{"text_format":"1","workbook":"xlsx","n_sheets":3,"sheets":["One Year Graphs","Net Worth","One Year Info"],"not_rendered":{"charts":6,"images":1,"macros":1,"external_links":0,"defined_names":2,"comments":1,"pivot_tables":0},"unopened":[],"bounds":{"document_bytes":16777216,"sheet_cells":100000,"rows_first":2000,"rows_last":500,"rows_between":2000,"halvings":0,"cell_chars":16384,"cell_head_chars":4096},"cells_cut":0,"cells_raw":0,"read":"whole","date_system":"1900"}

{"sheet":"One Year Graphs","index":0,"n_rows":13,"n_cols":30,"rows_kept":13,"cut":false,"hidden":false,"merged":[]}
[null,null,null,null,null,null,null,null,null,null,null,null,null,null,null,null,null,null,null,null,null,null,null,null,null,null,null,null,null,"Copyright Kevin McKee"]
[null,null,null,null,null,null,null,null,null,null,null,null,null,null,null,null,null,null,null,null,null,null,null,null,null,null,null,null,null,"Thousandaire.com"]
[null,null,null,null,null,null,null,null,null,null,null,null,null,null,null,null,null,null,null,null,null,null,null,null,null,null,null,null,null,"Free for personal use. Contact kevin@thousandaire.com for other uses."]
[]
[null,null,null,null,null,null,null,null,null,null,null,null,null,null,null,null,null,null,null,null,null,null,null,null,null,null,null,null,null,"Instructions:"]
[null,null,null,null,null,null,null,null,null,null,null,null,null,null,null,null,null,null,null,null,null,null,null,null,null,null,null,null,null,"Just look at the pretty pictures."]
[]
[null,null,null,null,null,null,null,null,null,null,null,null,null,null,null,null,null,null,null,null,null,null,null,null,null,null,null,null,null,"If you want to put one line on a different axis (like I "]
[null,null,null,null,null,null,null,null,null,null,null,null,null,null,null,null,null,null,null,null,null,null,null,null,null,null,null,null,null,"did in the example), just double click that line."]
[]
[null,null,null,null,null,null,null,null,null,null,null,null,null,null,null,null,null,null,null,null,null,null,null,null,null,null,null,null,null,"Advanced excel users can change the standard graphs"]
[null,null,null,null,null,null,null,null,null,null,null,null,null,null,null,null,null,null,null,null,null,null,null,null,null,null,null,null,null,"to custom made ones by using information in the "]
[null,null,null,null,null,null,null,null,null,null,null,null,null,null,null,null,null,null,null,null,null,null,null,null,null,null,null,null,null,"Net Worth tab and the One Year Info tab."]

{"sheet":"Net Worth","index":1,"n_rows":51,"n_cols":79,"rows_kept":51,"cut":false,"hidden":false,"merged":[[0,72,0,76],[0,36,0,40],[0,42,0,46],[0,48,0,52],[0,54,0,58],[0,60,0,64],[0,66,0,70],[0,30,0,34],[0,0,0,4],[0,6,0,10],[0,12,0,16],[0,18,0,22],[0,24,0,28]]}
["2010-10-01",null,null,null,null,null,"2010-11-01",null,null,null,null,null,"2010-12-01",null,null,null,null,null,"2011-01-01",null,null,null,null,null,"2011-02-01",null,null,null,null,null,"2011-03-01",null,null,null,null,null,"2011-04-01",null,null,null,null,null,"2011-05-01",null,null,null,null,null,"2011-06-01",null,null,null,null,null,"2011-07-01",null,null,null,null,null,"2011-08-01",null,null,null,null,null,"2011-09-01",null,null,null,null,null,"2011-10-01"]
["Assets - Restricted","Amount",null,"Debts - Installment","Amount",null,"Assets - Restricted","Amount",null,"Debts - Installment","Amount",null,"Assets - Restricted","Amount",null,"Debts - Installment","Amount",null,"Assets - Restricted","Amount",null,"Debts - Installment","Amount",null,"Assets - Restricted","Amount",null,"Debts - Installment","Amount",null,"Assets - Restricted","Amount",null,"Debts - Installment","Amount",null,"Assets - Restricted","Amount",null,"Debts - Installment","Amount",null,"Assets - Restricted","Amount",null,"Debts - Installment","Amount",null,"Assets - Restricted","Amount",null,"Debts - Installment","Amount",null,"Assets - Restricted","Amount",null,"Debts - Installment","Amount",null,"Assets - Restricted","Amount",null,"Debts - Installment","Amount",null,"Assets - Restricted","Amount",null,"Debts - Installment","Amount",null,"Assets - Restricted","Amount",null,"Debts - Installment","Amount"]
["401k",null,null,"Student Loan 1"]
["Roth IRA",null,null,"Student Loan 2"]
["Traditional IRA",null,null,"Personal Loan 1"]
["Health Savings Account"]
[]
[null,null,null,null,null,null,null,null,null,null,null,null,null,null,null,null,null,null,null,null,null,null,null,null,null,null,null,null,null,null,null,null,null,null,null,null,null,null,null,null,null,null,null,null,null,null,null,null,null,null,null,null,null,null,null,null,null,null,null,null,null,null,null,null,null,null,null,null,null,null,null,null,null,null,null,null,null,null,"Instructions:"]
[]
[]
[]
[]
["Assets - Liquid","Amount",null,"Credit - Transacting","Amount",null,"Assets - Liquid","Amount",null,"Credit - Transacting","Amount",null,"Assets - Liquid","Amount",null,"Credit - Transacting","Amount",null,"Assets - Liquid","Amount",null,"Credit - Transacting","Amount",null,"Assets - Liquid","Amount",null,"Credit - Transacting","Amount",null,"Assets - Liquid","Amount",null,"Credit - Transacting","Amount",null,"Assets - Liquid","Amount",null,"Credit - Transacting","Amount",null,"Assets - Liquid","Amount",null,"Credit - Transacting","Amount",null,"Assets - Liquid","Amount",null,"Credit - Transacting","Amount",null,"Assets - Liquid","Amount",null,"Credit - Transacting","Amount",null,"Assets - Liquid","Amount",null,"Credit - Transacting","Amount",null,"Assets - Liquid","Amount",null,"Credit - Transacting","Amount",null,"Assets - Liquid","Amount",null,"Credit - Transacting","Amount"]
["Checking 1",null,null,"Credit Card 1"]
["Checking 2",null,null,"Credit Card 2"]
["Savings",null,null,"Credit Card 3"]
[]
[]
[]
[]
[]
[]
[]
["Assets - Investment","Amount",null,"Credit - Revolving","Amount",null,"Assets - Investment","Amount",null,"Credit - Revolving","Amount",null,"Assets - Investment","Amount",null,"Credit - Revolving","Amount",null,"Assets - Investment","Amount",null,"Credit - Revolving","Amount",null,"Assets - Investment","Amount",null,"Credit - Revolving","Amount",null,"Assets - Investment","Amount",null,"Credit - Revolving","Amount",null,"Assets - Investment","Amount",null,"Credit - Revolving","Amount",null,"Assets - Investment","Amount",null,"Credit - Revolving","Amount",null,"Assets - Investment","Amount",null,"Credit - Revolving","Amount",null,"Assets - Investment","Amount",null,"Credit - Revolving","Amount",null,"Assets - Investment","Amount",null,"Credit - Revolving","Amount",null,"Assets - Investment","Amount",null,"Credit - Revolving","Amount",null,"Assets - Investment","Amount",null,"Credit - Revolving","Amount"]
["Investment 1",null,null,"Credit Card 4"]
["Investment 2"]
[]
[]
[]
[]
[]
[]
[]
["Assets - Physical","Amount",null,"Debt - Physical","Amount",null,"Assets - Physical","Amount",null,"Debt - Physical","Amount",null,"Assets - Physical","Amount",null,"Debt - Physical","Amount",null,"Assets - Physical","Amount",null,"Debt - Physical","Amount",null,"Assets - Physical","Amount",null,"Debt - Physical","Amount",null,"Assets - Physical","Amount",null,"Debt - Physical","Amount",null,"Assets - Physical","Amount",null,"Debt - Physical","Amount",null,"Assets - Physical","Amount",null,"Debt - Physical","Amount",null,"Assets - Physical","Amount",null,"Debt - Physical","Amount",null,"Assets - Physical","Amount",null,"Debt - Physical","Amount",null,"Assets - Physical","Amount",null,"Debt - Physical","Amount",null,"Assets - Physical","Amount",null,"Debt - Physical","Amount",null,"Assets - Physical","Amount",null,"Debt - Physical","Amount"]
["House",null,null,"House Mortgage"]
["Car",null,null,"Car Loan"]
["Other",null,null,"Other Loan"]
[]
[]
[]
{"$rows_left_out":12}
{"sheet":"One Year Info","index":2,"n_rows":38,"n_cols":18,"rows_kept":38,"cut":false,"hidden":false,"merged":[[0,4,0,7],[0,8,0,11],[0,12,0,13]]}
[null,null,null,null,"Assets",null,null,null,"Debts",null,null,null,"Retirement"]
[null,"Net Worth","Assets","Debts","Restricted","Liquid","Investment","Physical","Installment","Transacting","Revolving","Physical","401k","Roth IRA"]
[{"$f":"VLOOKUP(MONTH('Net Worth'!A1),Months,2,0)","v":"Oct"},{"$f":"'Net Worth'!E49","v":0},{"$f":"'Net Worth'!B47","v":0},{"$f":"'Net Worth'!E47","v":0},{"$f":"'Net Worth'!B42","v":0},{"$f":"'Net Worth'!B43","v":0},{"$f":"'Net Worth'!B44","v":0},{"$f":"'Net Worth'!B45","v":0},{"$f":"'Net Worth'!E42","v":0},{"$f":"'Net Worth'!E43","v":0},{"$f":"'Net Worth'!E44","v":0},{"$f":"'Net Worth'!E45","v":0},{"$f":"'Net Worth'!B3","v":0},{"$f":"'Net Worth'!B4","v":0}]
[{"$f":"VLOOKUP(MONTH('Net Worth'!G1),Months,2,0)","v":"Nov"},{"$f":"'Net Worth'!K49","v":0},{"$f":"'Net Worth'!H47","v":0},{"$f":"'Net Worth'!K47","v":0},{"$f":"'Net Worth'!H42","v":0},{"$f":"'Net Worth'!H43","v":0},{"$f":"'Net Worth'!H44","v":0},{"$f":"'Net Worth'!H45","v":0},{"$f":"'Net Worth'!K42","v":0},{"$f":"'Net Worth'!K43","v":0},{"$f":"'Net Worth'!K44","v":0},{"$f":"'Net Worth'!K45","v":0},{"$f":"'Net Worth'!H3","v":0},{"$f":"'Net Worth'!H4","v":0}]
[{"$f":"VLOOKUP(MONTH('Net Worth'!M1),Months,2,0)","v":"Dec"},{"$f":"'Net Worth'!Q49","v":0},{"$f":"'Net Worth'!N47","v":0},{"$f":"'Net Worth'!Q47","v":0},{"$f":"'Net Worth'!N42","v":0},{"$f":"'Net Worth'!N43","v":0},{"$f":"'Net Worth'!N44","v":0},{"$f":"'Net Worth'!N45","v":0},{"$f":"'Net Worth'!Q42","v":0},{"$f":"'Net Worth'!Q43","v":0},{"$f":"'Net Worth'!Q44","v":0},{"$f":"'Net Worth'!Q45","v":0},{"$f":"'Net Worth'!N3","v":0},{"$f":"'Net Worth'!N4","v":0}]
[{"$f":"VLOOKUP(MONTH('Net Worth'!S1),Months,2,0)","v":"Jan"},{"$f":"'Net Worth'!W49","v":0},{"$f":"'Net Worth'!T47","v":0},{"$f":"'Net Worth'!W47","v":0},{"$f":"'Net Worth'!T42","v":0},{"$f":"'Net Worth'!T43","v":0},{"$f":"'Net Worth'!T44","v":0},{"$f":"'Net Worth'!T45","v":0},{"$f":"'Net Worth'!W42","v":0},{"$f":"'Net Worth'!W43","v":0},{"$f":"'Net Worth'!W44","v":0},{"$f":"'Net Worth'!W45","v":0},{"$f":"'Net Worth'!T3","v":0},{"$f":"'Net Worth'!T4","v":0}]
[{"$f":"VLOOKUP(MONTH('Net Worth'!Y1),Months,2,0)","v":"Feb"},{"$f":"'Net Worth'!AC49","v":0},{"$f":"'Net Worth'!Z47","v":0},{"$f":"'Net Worth'!AC47","v":0},{"$f":"'Net Worth'!Z42","v":0},{"$f":"'Net Worth'!Z43","v":0},{"$f":"'Net Worth'!Z44","v":0},{"$f":"'Net Worth'!Z45","v":0},{"$f":"'Net Worth'!AC42","v":0},{"$f":"'Net Worth'!AC43","v":0},{"$f":"'Net Worth'!AC44","v":0},{"$f":"'Net Worth'!AC45","v":0},{"$f":"'Net Worth'!Z3","v":0},{"$f":"'Net Worth'!Z4","v":0}]
[{"$f":"VLOOKUP(MONTH('Net Worth'!AE1),Months,2,0)","v":"Mar"},{"$f":"'Net Worth'!AI49","v":0},{"$f":"'Net Worth'!AF47","v":0},{"$f":"'Net Worth'!AI47","v":0},{"$f":"'Net Worth'!AF42","v":0},{"$f":"'Net Worth'!AF43","v":0},{"$f":"'Net Worth'!AF44","v":0},{"$f":"'Net Worth'!AF45","v":0},{"$f":"'Net Worth'!AI42","v":0},{"$f":"'Net Worth'!AI43","v":0},{"$f":"'Net Worth'!AI44","v":0},{"$f":"'Net Worth'!AI45","v":0},{"$f":"'Net Worth'!AF3","v":0},{"$f":"'Net Worth'!AF4","v":0}]
[{"$f":"VLOOKUP(MONTH('Net Worth'!AK1),Months,2,0)","v":"Apr"},{"$f":"'Net Worth'!AO49","v":0},{"$f":"'Net Worth'!AL47","v":0},{"$f":"'Net Worth'!AO47","v":0},{"$f":"'Net Worth'!AL42","v":0},{"$f":"'Net Worth'!AL43","v":0},{"$f":"'Net Worth'!AL44","v":0},{"$f":"'Net Worth'!AL45","v":0},{"$f":"'Net Worth'!AO42","v":0},{"$f":"'Net Worth'!AO43","v":0},{"$f":"'Net Worth'!AO44","v":0},{"$f":"'Net Worth'!AO45","v":0},{"$f":"'Net Worth'!AL3","v":0},{"$f":"'Net Worth'!AL4","v":0}]
[{"$f":"VLOOKUP(MONTH('Net Worth'!AQ1),Months,2,0)","v":"May"},{"$f":"'Net Worth'!AU49","v":0},{"$f":"'Net Worth'!AR47","v":0},{"$f":"'Net Worth'!AU47","v":0},{"$f":"'Net Worth'!AR42","v":0},{"$f":"'Net Worth'!AR43","v":0},{"$f":"'Net Worth'!AR44","v":0},{"$f":"'Net Worth'!AR45","v":0},{"$f":"'Net Worth'!AU42","v":0},{"$f":"'Net Worth'!AU43","v":0},{"$f":"'Net Worth'!AU44","v":0},{"$f":"'Net Worth'!AU45","v":0},{"$f":"'Net Worth'!AR3","v":0},{"$f":"'Net Worth'!AR4","v":0}]
[{"$f":"VLOOKUP(MONTH('Net Worth'!AW1),Months,2,0)","v":"Jun"},{"$f":"'Net Worth'!BA49","v":0},{"$f":"'Net Worth'!AX47","v":0},{"$f":"'Net Worth'!BA47","v":0},{"$f":"'Net Worth'!AX42","v":0},{"$f":"'Net Worth'!AX43","v":0},{"$f":"'Net Worth'!AX44","v":0},{"$f":"'Net Worth'!AX45","v":0},{"$f":"'Net Worth'!BA42","v":0},{"$f":"'Net Worth'!BA43","v":0},{"$f":"'Net Worth'!BA44","v":0},{"$f":"'Net Worth'!BA45","v":0},{"$f":"'Net Worth'!AX3","v":0},{"$f":"'Net Worth'!AX4","v":0}]
[{"$f":"VLOOKUP(MONTH('Net Worth'!BC1),Months,2,0)","v":"Jul"},{"$f":"'Net Worth'!BG49","v":0},{"$f":"'Net Worth'!BD47","v":0},{"$f":"'Net Worth'!BG47","v":0},{"$f":"'Net Worth'!BD42","v":0},{"$f":"'Net Worth'!BD43","v":0},{"$f":"'Net Worth'!BD44","v":0},{"$f":"'Net Worth'!BD45","v":0},{"$f":"'Net Worth'!BG42","v":0},{"$f":"'Net Worth'!BG43","v":0},{"$f":"'Net Worth'!BG44","v":0},{"$f":"'Net Worth'!BG45","v":0},{"$f":"'Net Worth'!BD3","v":0},{"$f":"'Net Worth'!BD4","v":0}]
[{"$f":"VLOOKUP(MONTH('Net Worth'!BI1),Months,2,0)","v":"Aug"},{"$f":"'Net Worth'!BM49","v":0},{"$f":"'Net Worth'!BJ47","v":0},{"$f":"'Net Worth'!BM47","v":0},{"$f":"'Net Worth'!BJ42","v":0},{"$f":"'Net Worth'!BJ43","v":0},{"$f":"'Net Worth'!BJ44","v":0},{"$f":"'Net Worth'!BJ45","v":0},{"$f":"'Net Worth'!BM42","v":0},{"$f":"'Net Worth'!BM43","v":0},{"$f":"'Net Worth'!BM44","v":0},{"$f":"'Net Worth'!BM45","v":0},{"$f":"'Net Worth'!BJ3","v":0},{"$f":"'Net Worth'!BJ4","v":0}]
[{"$f":"VLOOKUP(MONTH('Net Worth'!BO1),Months,2,0)","v":"Sep"},{"$f":"'Net Worth'!BS49","v":0},{"$f":"'Net Worth'!BP47","v":0},{"$f":"'Net Worth'!BS47","v":0},{"$f":"'Net Worth'!BP42","v":0},{"$f":"'Net Worth'!BP43","v":0},{"$f":"'Net Worth'!BP44","v":0},{"$f":"'Net Worth'!BP45","v":0},{"$f":"'Net Worth'!BS42","v":0},{"$f":"'Net Worth'!BS43","v":0},{"$f":"'Net Worth'!BS44","v":0},{"$f":"'Net Worth'!BS45","v":0},{"$f":"'Net Worth'!BP3","v":0},{"$f":"'Net Worth'!BP4","v":0}]
[{"$f":"VLOOKUP(MONTH('Net Worth'!BU1),Months,2,0)","v":"Oct"},{"$f":"'Net Worth'!BY49","v":0},{"$f":"'Net Worth'!BV47","v":0},{"$f":"'Net Worth'!BY47","v":0},{"$f":"'Net Worth'!BV42","v":0},{"$f":"'Net Worth'!BV43","v":0},{"$f":"'Net Worth'!BV44","v":0},{"$f":"'Net Worth'!BV45","v":0},{"$f":"'Net Worth'!BY42","v":0},{"$f":"'Net Worth'!BY43","v":0},{"$f":"'Net Worth'!BY44","v":0},{"$f":"'Net Worth'!BY45","v":0},{"$f":"'Net Worth'!BV3","v":0},{"$f":"'Net Worth'!BV4","v":0}]
[]
[]
[]
[]
[]
[]
[]
[]
[]
[]
[null,null,null,null,null,null,null,null,null,null,null,null,null,null,null,null,"Month Lookup"]
[null,null,null,null,null,null,null,null,null,null,null,null,null,null,null,null,1,"Jan"]
[null,null,null,null,null,null,null,null,null,null,null,null,null,null,null,null,2,"Feb"]
[null,null,null,null,null,null,null,null,null,null,null,null,null,null,null,null,3,"Mar"]
[null,null,null,null,null,null,null,null,null,null,null,null,null,null,null,null,4,"Apr"]
[null,null,null,null,null,null,null,null,null,null,null,null,null,null,null,null,5,"May"]
[null,null,null,null,null,null,null,null,null,null,null,null,null,null,null,null,6,"Jun"]
[null,null,null,null,null,null,null,null,null,null,null,null,null,null,null,null,7,"Jul"]
[null,null,null,null,null,null,null,null,null,null,null,null,null,null,null,null,8,"Aug"]
[null,null,null,null,null,null,null,null,null,null,null,null,null,null,null,null,9,"Sep"]
[null,null,null,null,null,null,null,null,null,null,null,null,null,null,null,null,10,"Oct"]
[null,null,null,null,null,null,null,null,null,null,null,null,null,null,null,null,11,"Nov"]
[null,null,null,null,null,null,null,null,null,null,null,null,null,null,null,null,12,"Dec"]